Operette
type: Concept
definition: Ein Gattung von Musiktheater, die meist ein leichtes und humorvolles Thema hat und bei der ein Teil des Librettos gesprochen und nicht gesungen wird
in scheme: mediatopic
created: 2012-10-04T12:00:00+00:00
modified: 2021-09-30T12:00:00+00:00
broader: http://cv.iptc.org/newscodes/mediatopic/20000029