Opereta
type: Concept
definition: Género de ópera que generalmente tiene un tema ligero o humorístico en el cual parte del libreto se suele declamar en lugar de cantar
in scheme: mediatopic
created: 2012-10-04T12:00:00+00:00
modified: 2021-09-30T12:00:00+00:00
broader: http://cv.iptc.org/newscodes/mediatopic/20000029