kunstutstilling
type: Concept
preferred label: Exposition artistique @fr
preferred label: Konstutställning @se
preferred label: Exposición de arte @es
preferred label: Kunstausstellung @de
preferred label: art exhibition @en-gb
preferred label: exposição artística @pt-pt
preferred label: udstilling @dk
preferred label: 艺术展览 @zh-hans
preferred label: معرض فني @ar
definition: Zeitlich begrenzte Präsentation von Kunst in einem Museum, einer Kunsthalle oder Galerie @de
definition: Temporary presentation of art in museums, art halls or galleries @en-gb
definition: Ett tillfälle då en eller flera konstverk visas upp i en lokal, vanligtvis under en avgränsad period. @se
definition: Présentation temporaire d'art dans des musées, des salles ou des galeries @fr
definition: Presentación temporal de arte en museos, salas de arte o galerías @es
definition: Apresentação temporária de arte em museus, salas de arte ou galerias. @pt-pt
definition: Midlertidig præsentation af kunst eller særemner på museer, kunsthaller eller gallerier. @dk
definition: 在博物馆、艺术大厅或画廊举办的短期艺术品展出 @zh-hans
definition: Mellombels presentasjon av kunst i museum, kunsthallar eller galleri.
definition: Midlertidig presentasjon av kunst i museer, kunsthaller eller gallerier.
in scheme: mediatopic
created: 2012-10-04T12:00:00+00:00
modified: 2023-03-31T12:00:00+00:00
broader: http://cv.iptc.org/newscodes/mediatopic/20000038