Alpinismus
type: Concept
definition: Sportliche Aktivität in den Bergen, schließt das Klettern und Wandern ein
in scheme: mediatopic
created: 2012-10-04T12:00:00+00:00
modified: 2023-10-02T12:00:00+00:00
broader: http://cv.iptc.org/newscodes/mediatopic/20000560