chess
type: Concept
preferred label: Schack @se
preferred label: xadrez @pt-pt
preferred label: skak @dk
preferred label: 国际象棋 @zh-hans
preferred label: sjakk @no-nb
preferred label: Schach @de
preferred label: Échecs @fr
preferred label: Ajedrez @es
preferred label: شطرنج @ar
definition: Brädspel mellan två spelare som har 16 pjäser var när partiet startar. Olika pjäser får flytta enligt olika mönster. Den som ställer motståndarens kung så den inte kan flytta vinner. Om ingen spelare lyckas med det kan det sluta oavgjort, vilket kallas remi. @se
definition: Competition between two players using a chequered board with 16 pieces to each side, each with specific ranges of movement depending on their identity
definition: Jogo de estratégia entre dois jogadores no qual se utiliza um tabuleiro dividido em casas alternadamente claras e escuras, com 16 peças para cada jogador, que se jogam com movimentos específicos que dependem da sua identidade. @pt-pt
definition: Brætspil mellem to spillere, der har 16 brikker hver, når spillet starter. Skiftevis laver hver modstander et træk og bevæger sig efter forskellige mønstre. Den, der sætter modstanderens konge mat, så den ikke kan flytte sig, vinder. @dk
definition: 两个棋手使用由方格组成的棋盘进行比赛，棋盘每方各有16枚棋子，每个棋子的移动规则视其身份而定 @zh-hans
definition: Wettbewerb zwischen zwei Spielern mit einem Schachbrett mit 16 Spielsteinen auf jeder Seite, die je nach ihrer Identität spezifische Bewegungsspielräume haben @de
definition: Competition between two players using a checkered board with 16 pieces to each side, each with specific ranges of movement depending on their identity
in scheme: mediatopic
created: 2014-11-07T12:00:00+00:00
modified: 2021-07-12T12:00:00+00:00
broader: http://cv.iptc.org/newscodes/mediatopic/20000822