国际象棋
type: Concept
definition: 两个棋手使用由方格组成的棋盘进行比赛，棋盘每方各有16枚棋子，每个棋子的移动规则视其身份而定
in scheme: mediatopic
created: 2014-11-07T12:00:00+00:00
modified: 2021-07-12T12:00:00+00:00
broader: http://cv.iptc.org/newscodes/mediatopic/20000822