internet das coisas
type: Concept
preferred label: Internet of Things @se
preferred label: tingenes internet @dk
preferred label: 物联网 @zh-hans
preferred label: tingenes internett @no-nb
preferred label: Internet der Dinge @de
preferred label: Objets connectés @fr
preferred label: Objetos conectados @es
preferred label: انترنت الاشياء @ar
preferred label: nett-tilkopla ting @no-nn
definition: Vardagsföremål som hushållsapparater, kläder och accessoarer, men även maskiner, fordon och byggnader, med inbyggd elektronik och internetuppkoppling, vilket gör att de kan styras eller utbyta data över nätet. @se
definition: A network of devices using microchips, electronic sensors and communication by the Internet @en-gb
definition: Rede de objetos e utensílios interligados por protocolos de comunicação, usando microchips, sensores eletrónicos e comunicação pela Internet.
definition: Rede de objetos e utensílios interligados por protocolos de comunicação, usando microchips, sensores eletrônicos e comunicação pela Internet.
definition: Produkter med indbygget elektronik og internetforbindelse, der gør det muligt for dem at kontrollere eller udveksle data over netværket. @dk
definition: 由使用微芯片、电子传感器和因特网通信的设备组成的网络 @zh-hans
definition: Ein Netzwerk von Geräten mit Mikrochips, elektronischen Sensoren und Kommunikation über das Interne @de
change note: Retired. Use medtop:20000226 hardware, or generic medtop:20000225 computing and information technology as appropriate. @en-gb
in scheme: mediatopic
created: 2016-04-04T12:00:00+00:00
modified: 2023-03-31T12:00:00+00:00
retired: 2023-03-31T12:00:00+00:00
broader: http://cv.iptc.org/newscodes/mediatopic/20000225