支付服务
type: Concept
definition: 执行支付的服务，包括现金、支票、信用卡、借记卡、直接借记、电子资金转帐、网上银行、电子和移动支付等支付方式
in scheme: mediatopic
created: 2016-04-04T12:00:00+00:00
modified: 2023-03-31T12:00:00+00:00
broader: http://cv.iptc.org/newscodes/mediatopic/20001371