中小企业
type: Concept
definition: 中小企业(SME)是指员工数量、结余和营业额不能超过其所在国家规定的某些限制的公司
in scheme: mediatopic
created: 2016-04-04T12:00:00+00:00
modified: 2024-03-28T12:00:00+00:00
broader: http://cv.iptc.org/newscodes/mediatopic/20000349