英式橄榄球联盟
type: Concept
definition: 英式橄榄球。椭圆形的的球可以踢球、带球以及用手传球。带球过对方底线或踢球进对方门柱内得分
in scheme: mediatopic
created: 2016-04-05T12:00:00+00:00
modified: 2021-07-12T12:00:00+00:00
broader: http://cv.iptc.org/newscodes/mediatopic/20000822