Paralympic Games
type: Concept
preferred label: Paralympics @se
preferred label: jogos paraolímpicos @pt-pt
preferred label: Paralympiske Lege @dk
preferred label: 残疾人运动会 @zh-hans
preferred label: paralympics @no-nb
preferred label: Paralympische Spiele @de
preferred label: Jeux paralympiques @fr
preferred label: Juegos paralímpicos @es
preferred label: ألعاب بارالمبية @ar
preferred label: paralympiske leikar @no-nn
definition: Games for disabled athletes organised by the International Paralympic Committee and held each 4 years in winter or summer
definition: Internationella idrottstävlingar för elitidrottare med funktionsnedsättning. @se
definition: Evento desportivo internacional para atletas com deficiência organizado pelo Comité Paraolímpico Internacional e realizado a cada 4 anos no verão ou inverno. @pt-pt
definition: Evento esportivo internacional para atletas com deficiência organizado pelo Comitê Paraolímpico Internacional e realizado a cada 4 anos no verão ou inverno. @pt-br
definition: Sportslege for handicappede atleter arrangeret af Den Internationale Paralympiske Komité og afholdt hvert 4. år om vinteren eller sommeren. @dk
definition: 国际残疾人委员会为残疾运动员组织的运动会，每四年一次，冬季或夏季 @zh-hans
definition: Vom Internationalen Paralympischen Komitee organisierte Spiele für behinderte Sportler, die alle 4 Jahre im Winter oder Sommer stattfinden @de
definition: Games for disabled athletes organized by the International Paralympic Committee and held each 4 years in winter or summer
in scheme: mediatopic
created: 2016-08-24T12:00:00+00:00
modified: 2021-12-17T12:00:00+00:00
broader: http://cv.iptc.org/newscodes/mediatopic/20001108