festival
type: Concept
definition: Events showcasing artistic endeavours, often regularly occurring, such as dance, music, theatre, poetry or comedy festivals
in scheme: mediatopic
created: 2018-04-09T12:00:00+00:00
modified: 2021-07-12T12:00:00+00:00
broader: http://cv.iptc.org/newscodes/mediatopic/20000002