嘻哈
type: Concept
definition: 20世纪70年代在美国的非裔美国人社区发展起来的一种音乐类型，通常由电子伴奏的说唱组成
in scheme: mediatopic
created: 2019-04-06T12:00:00+00:00
modified: 2021-07-12T12:00:00+00:00
broader: http://cv.iptc.org/newscodes/mediatopic/20000021