sexual misconduct
type: Concept
preferred label: sexchikane @dk
preferred label: seksuell trakassering @no-nb
preferred label: má conduta sexual @pt-br
preferred label: Sexuellt ofredande @se
preferred label: 性行为不端 @zh-hans
preferred label: sexuelles Fehlverhalten @de
preferred label: Harcèlement sexuel @fr
preferred label: Acoso sexual @es
preferred label: تحرش جنسي @ar
definition: Uønsket adfærd af seksuel karakter, der er af mindre fornærmelse end seksualforbrydelse, især når adfærd forekommer i en normalt ikke-seksuel situation, eller hvor der er et aspekt af personlig magt eller autoritet involveret. @dk
definition: Unwanted behaviour of a sexual nature that is of lesser offense than felony sexual assault, particularly when behaviour occurs in a normally non-sexual situation, or where there is some aspect of personal power or authority involved
definition: Comportamento indesejado de natureza sexual que constitui uma ofensa menor do que a agressão sexual dolosa, particularmente quando o comportamento ocorre em contexto normalmente não sexual, ou quando há algum aspecto de poder ou autoridade pessoal envolvido. @pt-br
definition: Comportamento indesejado de natureza sexual que constitui uma ofensa menor do que a agressão sexual dolosa, particularmente quando o comportamento ocorre em contexto normalmente não sexual, ou quando há algum aspeto de poder ou autoridade pessoal envolvido. @pt-pt
definition: Oönskade sexuella inviter, meddelanden, beröring, blottande osv. @se
definition: 一种不受欢迎的性行为，其罪行较重罪性侵犯轻，特别是当行为发生在正常的非性行为的情况下，或者涉及到个人权力或权威的某一方面时 @zh-hans
definition: Unerwünschtes Verhalten sexueller Natur, das weniger strafbar ist als schwere sexuelle Übergriffe, insbesondere wenn das Verhalten in einer normalerweise nicht-sexuellen Situation auftritt oder wenn ein Aspekt persönlicher Macht oder Autorität involviert ist @de
definition: Unwanted behavior of a sexual nature that is of lesser offense than felony sexual assault, particularly when behavior occurs in a normally non-sexual situation, or where there is some aspect of personal power or authority involved
in scheme: mediatopic
created: 2019-04-06T12:00:00+00:00
modified: 2024-07-01T12:00:00+00:00
broader: http://cv.iptc.org/newscodes/mediatopic/20000802