Rättspsykiatrisk vård
type: Concept
preferred label: court-ordered psychiatric treatment @en-gb
preferred label: tratamento psiquiátrico por ordem judicial @pt-pt
preferred label: psykiatrisk behandlingsdom @dk
preferred label: 法院强制精神治疗 @zh-hans
preferred label: tvungent psykisk helsevern @no-nb
preferred label: gerichtlich angeordnete psychiatrische Behandlung @de
preferred label: Traitement psychiatrique ordonné par le tribunal @fr
preferred label: Tratamiento psiquiátrico ordenado por el tribunal @es
preferred label: علاج نفسي بأمر قضائي @ar
preferred label: tvunge psykisk helsevern @no-nn
definition: Psychiatric treatment imposed upon persons with mental health conditions in prisons and jails or as a condition of probation, supervision or parole @en-gb
definition: Dom som innebär att den dömde tvingas till någon form av psykiatrisk vård och den exakta tiden hänger på hur vården fungerar och läkares bedömning.
definition: Tratamento psiquiátrico imposto a pessoas com problemas de saúde mental em prisões e cadeias ou como condição de liberdade condicional ou de supervisão. @pt-pt
definition: Dom, hvor retten i stedet for almindelig straf dømmer en psykisk syg kriminel til psykiatrisk behandling. @dk
definition: 监狱和拘留所对有精神健康问题的在押人员进行的精神治疗，或者作为缓刑、监管或假释的条件 @zh-hans
definition: Psychiatrische Behandlung, die Personen mit psychischen Erkrankungen in Gefängnissen oder als Bedingung für Bewährung, Überwachung oder Bewährung auferlegt wird @de
in scheme: mediatopic
created: 2019-04-06T12:00:00+00:00
modified: 2021-07-12T12:00:00+00:00
broader: http://cv.iptc.org/newscodes/mediatopic/20000134