法院强制精神治疗
type: Concept
definition: 监狱和拘留所对有精神健康问题的在押人员进行的精神治疗，或者作为缓刑、监管或假释的条件
in scheme: mediatopic
created: 2019-04-06T12:00:00+00:00
modified: 2021-07-12T12:00:00+00:00
broader: http://cv.iptc.org/newscodes/mediatopic/20000134