Bewährungsstrafe
type: Concept
definition: Rechtliche Regelung für den Fall, dass ein Richter die Verbüßung einer Strafe durch eine Person, die eines Verbrechens für schuldig befunden wurde, hinauszögert, um ihr eine Bewährungsfrist zu geben
in scheme: mediatopic
created: 2019-04-06T12:00:00+00:00
modified: 2021-07-12T12:00:00+00:00
broader: http://cv.iptc.org/newscodes/mediatopic/20000134