Skogsbrand
type: Concept
preferred label: wildfire @en-gb
preferred label: incêndio florestal @pt-pt
preferred label: skovbrand @dk
preferred label: 野火 @zh-hans
preferred label: skog-, lyng- og gressbrann @no-nb
preferred label: Flächenbrand @de
preferred label: Feu de forêt @fr
preferred label: Incendio forestal @es
preferred label: حرائق الغابات @ar
preferred label: skog-, lyng- og grasbrann @no-nn
definition: An uncontrolled fire in an area of combustible vegetation @en-gb
definition: Brand som i huvudsak gäller vegetation (skog) som brinner ner.
definition: Incêndio incontrolável em área de vegetação combustível no campo ou em zona rural. @pt-pt
definition: Brand, der hovedsageligt rammer vegetation (skov). @dk
definition: 也译：山火。在乡村或郊野的可燃植被地区发生的不受控制的火灾 @zh-hans
definition: Ein unkontrolliertes Feuer in einem Gebiet mit brennbarer Vegetation @de
in scheme: mediatopic
created: 2019-04-06T12:00:00+00:00
modified: 2021-07-12T12:00:00+00:00
broader: http://cv.iptc.org/newscodes/mediatopic/20000150