Textil
type: Concept
preferred label: textile arts @en-gb
preferred label: artes têxteis @pt-pt
preferred label: tekstilkunst @dk
preferred label: 纺织艺术 @zh-hans
preferred label: Textilkunst @de
preferred label: Arts textiles @fr
preferred label: Artes textiles @es
preferred label: فنون النسيج @ar
definition: Arts and crafts that use plant, animal, or synthetic fibres to construct practical or decorative object @en-gb
definition: Hantverk där olika former av fiber används för att producera praktiska och/eller dekorativa objekt.
definition: Artes e ofícios que usam fibras vegetais, animais ou sintéticas para construir objetos práticos ou decorativos. @pt-pt
definition: Håndværk, hvor forskellige former for fiber bruges til at fremstille praktiske og/eller dekorative genstande. @dk
definition: 用植物、动物或合成纤维制作实用或装饰性物品的工艺美术 @zh-hans
definition: Kunsthandwerk, bei dem pflanzliche, tierische oder synthetische Fasern zur Herstellung praktischer oder dekorativer Gegenstände verwendet werden @de
in scheme: mediatopic
created: 2019-04-06T12:00:00+00:00
modified: 2021-07-12T12:00:00+00:00
broader: http://cv.iptc.org/newscodes/mediatopic/20000031