geothermische Energie
type: Concept
definition: Thermische Energie, die in der Erde erzeugt und gespeichert wird
in scheme: mediatopic
created: 2019-04-06T12:00:00+00:00
modified: 2023-03-31T12:00:00+00:00
broader: http://cv.iptc.org/newscodes/mediatopic/20000257