Solenergi
type: Concept
preferred label: solar power @en-gb
preferred label: energia solar @pt-pt
preferred label: solenergi @dk
preferred label: 太阳能发电 @zh-hans
preferred label: Solarenergie @de
preferred label: Énergie solaire @fr
preferred label: Energía solar @es
preferred label: الطاقة الشمسية @ar
definition: Electricity generated and harvested from the sun's rays @en-gb
definition: Energi som bygger på omvandling av solenergi i någon form.
definition: Eletricidade gerada e colhida a partir dos raios solares. @pt-pt
definition: Elektricitet produceret og genereret fra solens stråler. @dk
definition: 从太阳光中产生和获得的电能 @zh-hans
definition: Aus Sonnenstrahlen erzeugte und geerntete Elektrizitä @de
in scheme: mediatopic
created: 2019-04-06T12:00:00+00:00
modified: 2023-03-31T12:00:00+00:00
broader: http://cv.iptc.org/newscodes/mediatopic/20000257