energia hidroelétrica
type: Concept
preferred label: Vattenkraft @se
preferred label: hydroelectric power @en-gb
preferred label: energia hidrelétrica
preferred label: vandkraft @dk
preferred label: 水力发电 @zh-hans
preferred label: vannkraft @no-nb
preferred label: Wasserkraft @de
preferred label: Énergie hydroélectrique @fr
preferred label: Energía hidroeléctrica @es
preferred label: طاقة هيدروالكترونية @ar
preferred label: vasskraft @no-nn
definition: Electricity produced from hydropower when water flows through turbines @en-gb
definition: Energi som genereras genom att leda vatten genom turbiner. Vattnet samlas ofta i dammar så flödet kan regleras efter behov. @se
definition: Eletricidade produzida a partir de energia hídrica quando a água passa através de turbinas.
definition: Energi genereret ved at føre vand gennem turbiner. Vandet opsamles ofte i damme, så strømmen kan reguleres efter behov. @dk
definition: 当水流过涡轮时产生的电能 @zh-hans
definition: Elektrizität, die aus Wasserkraft erzeugt wird, wenn Wasser durch Turbinen fließt @de
in scheme: mediatopic
created: 2019-04-06T12:00:00+00:00
modified: 2023-03-31T12:00:00+00:00
broader: http://cv.iptc.org/newscodes/mediatopic/20000257