Freie Schulen
type: Concept
definition: Schulen, die mit Steuergeldern über die Regierung finanziert, aber von Unternehmen, Organisationen oder Genossenschaften betrieben werden
in scheme: mediatopic
created: 2019-04-06T12:00:00+00:00
modified: 2021-09-30T12:00:00+00:00
broader: http://cv.iptc.org/newscodes/mediatopic/20000400