medicina geral e familiar
type: Concept
definition: Especialidade médica que se dedica ao tratamento de uma ampla gama de problemas médicos gerais e dos seus sintomas.
in scheme: mediatopic
created: 2019-04-06T12:00:00+00:00
retired: 2022-06-14T12:00:00+00:00
modified: 2022-06-14T12:00:00+00:00
broader: http://cv.iptc.org/newscodes/mediatopic/20000487