kirurgi
type: Concept
preferred label: surgery @en-gb
preferred label: cirurgia @pt-br
preferred label: Kirurgi (ingrepp) @se
preferred label: 外科手术 @zh-hans
preferred label: Chirurgie @de
preferred label: Opération de chirurgie @fr
preferred label: Operación de cirugía @es
preferred label: عملية جراحية @ar
definition: Brug af snit lavet af medicinske instrumenter til at undersøge eller behandle en medicinsk tilstand eller skade.
definition: The use of incisions made by medical instruments to investigate or treat a medical condition or injury @en-gb
definition: Uso de incisões feitas por instrumentos médicos para investigar ou tratar uma condição médica ou lesão. @pt-br
definition: Metoder för att bota sjukdomar eller laga skador genom ingrepp i patientens kropp med hjälp av medicinska instrument. @se
definition: 利用医疗器械的切口来检查或治疗疾病或损伤 @zh-hans
definition: Die Verwendung von Einschnitten durch medizinische Instrumente zur Untersuchung oder Behandlung einer Erkrankung oder Verletzung @de
in scheme: mediatopic
created: 2019-04-06T12:00:00+00:00
modified: 2021-07-12T12:00:00+00:00
broader: http://cv.iptc.org/newscodes/mediatopic/20000464