centro de saúde
type: Concept
preferred label: Primärvård @se
preferred label: healthcare clinic @en-gb
preferred label: sundhedsklinik og lægehus @dk
preferred label: 诊所 @zh-hans
preferred label: primærhelsetjeneste @no-nb
preferred label: Gesundheitsklinik @de
preferred label: Clinique @fr
preferred label: Clínica @es
preferred label: عيادة @ar
preferred label: primærhelseteneste @no-nn
definition: Local medical facility or doctor's office associated with a general medicine practice, staffed by one or many doctors, focusing on outpatient treatment or giving recommendations to visit a specialist or hospital @en-gb
definition: Vårdinrättningar där personer med medicinska problem kan söka en första kontakt med sjukvården. Antingen för direkt åtgärde eller remiss för vidare behandling. @se
definition: Unidade médica local ou consultório médico associado a uma prática de medicina geral, com um ou vários médicos, que se dedica ao tratamento ambulatório ou reencaminha para um especialista ou hospital.
definition: Unidade médica local ou consultório médico associado a uma prática de medicina geral, com um ou vários médicos, que se dedica ao tratamento ambulatorial ou reencaminha para um especialista ou hospital.
definition: Sundhedsklinik eller lægehus, hvor mennesker med medicinske problemer kan søge indledende kontakt med sundhedsvæsenet. Enten til direkte handling eller henvisning til videre behandling. @dk
definition: 由一名或多名医生组成的与普通医疗业务有关的本地医疗机构或医生办公室，主要负责门诊治疗或提出去专科医院或医院就诊的建议 @zh-hans
definition: Örtliche medizinische Einrichtung oder Arztpraxis in Verbindung mit einer allgemeinmedizinischen Praxis, die mit einem oder mehreren Ärzten besetzt ist, sich auf ambulante Behandlung konzentriert oder Empfehlungen für den Besuch eines Facharztes oder Krankenhauses ausspricht @de
in scheme: mediatopic
created: 2019-04-06T12:00:00+00:00
modified: 2021-07-12T12:00:00+00:00
broader: http://cv.iptc.org/newscodes/mediatopic/20000461