健美
type: Concept
definition: 在比赛中，参赛者要摆出特定的姿势来展示他们经过剧烈运动后得到强化和扩大的肌肉。参赛者的评判标准包括对称性、肌肉发达程度和条件反射等
in scheme: mediatopic
created: 2019-06-26T12:00:00+00:00
modified: 2021-07-12T12:00:00+00:00
broader: http://cv.iptc.org/newscodes/mediatopic/20000822