indústria do petróleo e do gás
type: Concept
preferred label: olie- og gasindustrien @dk
preferred label: oil and gas @en-gb
preferred label: olje og gass @no-nb
preferred label: Olja och gas @se
preferred label: 油气工业 @zh-hans
preferred label: Öl- und Gasindustrie @de
preferred label: Industrie du gaz et du pétrole @fr
preferred label: Industria de petróleo y gas @es
preferred label: صناعة النفط والغاز @ar
definition: Virksomhed, der opsporer, udvinder, raffinerer, transporterer og sælger petrokemiske produkter. @dk
definition: The exploration, extraction, refining, transporting and marketing of petroleum products and natural gas @en-gb
definition: Exploração, extração, refino, transporte e comercialização de derivados de petróleo e de gás natural.
definition: Exploração, extração, refinação, transporte e comercialização de derivados de petróleo e de gás natural.
definition: Allt som rör olja och gas från prospektering till leverans och försäljning. @se
definition: 石油和天然气的勘探、开采、精炼、运输和销售等 @zh-hans
definition: Exploration, Gewinnung, Raffinierung, Transport und Vermarktung von Erdölprodukten und Erdgas @de
in scheme: mediatopic
created: 2019-07-25T12:00:00+00:00
modified: 2023-03-31T12:00:00+00:00
broader: http://cv.iptc.org/newscodes/mediatopic/20000256
narrower: http://cv.iptc.org/newscodes/mediatopic/20000259
narrower: http://cv.iptc.org/newscodes/mediatopic/20000262
narrower: http://cv.iptc.org/newscodes/mediatopic/20000263
narrower: http://cv.iptc.org/newscodes/mediatopic/20000268