infrastrukturprojekter
type: Concept
preferred label: infrastructure projects @en-gb
preferred label: samferdselsprosjekter @no-nb
preferred label: projetos de infraestrutura @pt-br
preferred label: Infrastruktur @se
preferred label: 基础设施项目 @zh-hans
preferred label: Infrastruktuprojekte @de
preferred label: Projets d'infrastructure @fr
preferred label: Proyectos de infraestructura @es
preferred label: مشاريع بنى تحتية @ar
preferred label: samferdselsprosjekt @no-nn
definition: Byggeri af grundlæggende faciliteter som veje, broer, tunneller, telekommunikation og el-net.
definition: The construction of the fundamental facilities and systems serving a country, city, or other area, including roads, bridges, dams, tunnels, telecommunications and electrical grids @en-gb
definition: Construção das instalações e dos sistemas básicos que servem um país, cidade ou outra área, como estradas, pontes, represas, túneis, telecomunicações e redes elétricas. @pt-br
definition: Planering, anläggning och underhåll av grundläggande saker som vägar, broar, järnvägar, elnät osv. @se
definition: 为国家、城市或其他地区服务的基础设施和系统的建设，包括道路、桥梁、大坝、隧道、电信和电网 @zh-hans
definition: Der Bau der grundlegenden Einrichtungen und Systeme, die ein Land, eine Stadt oder ein anderes Gebiet versorgen, einschließlich Straßen, Brücken, Dämme, Tunnel, Telekommunikations- und Stromnetze @de
in scheme: mediatopic
created: 2019-07-25T12:00:00+00:00
modified: 2021-07-12T12:00:00+00:00
broader: http://cv.iptc.org/newscodes/mediatopic/20000235