kropsmodifikation
type: Concept
preferred label: body modification @en-gb
preferred label: kroppsmodifikasjon @no-nb
preferred label: modificação corporal @pt-br
preferred label: Kroppsdekoration @se
preferred label: 身体修饰 @zh-hans
preferred label: Körpermodifikation @de
preferred label: Modification corporelle @fr
preferred label: Modificación corporal @es
preferred label: تعديل ملامح الجسم @ar
definition: Kropsudsmykning, der ændrer kroppens udseende. Det kan være i form af piercing eller tatovering.
definition: Actions taken to permanently or semi-permanently change body appearance, such as piercing and tattooing @en-gb
definition: Ações realizadas para alterar de modo permanente ou semipermanente a aparência do corpo, como piercings e tatuagens. @pt-br
definition: Intresse i att smycka den egna kroppen, exempelvis med taturering eller piercing. @se
definition: 为永久或半永久改变身体外观而采取的行动，如穿孔和纹身 @zh-hans
definition: Maßnahmen, die ergriffen werden, um das Aussehen des Körpers dauerhaft oder semi-permanent zu verändern, wie Piercing und Tätowierung @de
in scheme: mediatopic
created: 2019-07-30T12:00:00+00:00
modified: 2021-07-12T12:00:00+00:00
broader: http://cv.iptc.org/newscodes/mediatopic/20000572
narrower: http://cv.iptc.org/newscodes/mediatopic/20001251
narrower: http://cv.iptc.org/newscodes/mediatopic/20001252