politischer Konvent
type: Concept
definition: Treffen der politischen Partei zur Nominierung eines Kandidaten, zur Wahl eines Parteivorsitzenden oder zur Festlegung der Politik
in scheme: mediatopic
created: 2019-09-05T12:00:00+00:00
modified: 2025-03-31T12:00:00+00:00
broader: http://cv.iptc.org/newscodes/mediatopic/20000593