Regierungschefs
type: Concept
definition: Der höchste Beamte in der Exekutive eines souveränen Staates, eines föderierten Staates oder einer selbstverwalteten Kolonie
in scheme: mediatopic
created: 2019-09-05T12:00:00+00:00
modified: 2025-03-31T12:00:00+00:00
broader: http://cv.iptc.org/newscodes/mediatopic/20000593