偷运及贩卖人口
type: Concept
definition: 将自然人从一国或地区非法运送至另一国或地区的行为。如果涉及强迫劳动或性剥削等犯罪则为贩卖人口
in scheme: mediatopic
created: 2019-11-20T12:00:00+00:00
modified: 2021-07-12T12:00:00+00:00
broader: http://cv.iptc.org/newscodes/mediatopic/20000082