conquistas desportivas
type: Concept
preferred label: sport achievement @en-gb
preferred label: idrettsprestasjon @no-nb
preferred label: Sportsliga framgång @se
preferred label: sportspræstation @dk
preferred label: conquistas esportivas
preferred label: 体育成就 @zh-hans
preferred label: sportliche Leistung @de
preferred label: Exploit sportif @fr
preferred label: Logro deportivo @es
preferred label: انجاز رياضي @ar
definition: Records or honours earned by athletes for their performance @en-gb
definition: Records or honors earned by athletes for their performance @en-us
definition: Notering av en idrottares framgångar under karriären @se
definition: Rekord eller milepæl, som en atlet eller et hold har nået. @dk
definition: Recordes ou honras ganhos por atletas pelo seu desempenho.
definition: Recordes ou honras ganhos por atletas por seu desempenho.
definition: 运动员因运动成绩而获得的记录或荣誉 @zh-hans
definition: Rekorde oder Ehrungen von Sportlern für ihre Leistungen @de
in scheme: mediatopic
created: 2021-02-18T12:00:00+00:00
modified: 2021-07-12T12:00:00+00:00
broader: http://cv.iptc.org/newscodes/mediatopic/15000000
narrower: http://cv.iptc.org/newscodes/mediatopic/20001302
narrower: http://cv.iptc.org/newscodes/mediatopic/20001303
narrower: http://cv.iptc.org/newscodes/mediatopic/20001304