medalha desportiva
type: Concept
preferred label: sports medal and trophy @en-gb
preferred label: idrettsmedalje @no-nb
preferred label: Medaljer @se
preferred label: sportsmedalje @dk
preferred label: medalha esportiva
preferred label: 体育奖牌 @zh-hans
preferred label: Medaille @de
preferred label: Médaille sportive @fr
preferred label: Medalla deportiva @es
preferred label: ميدالية رياضية @ar
definition: Award given to an athlete or team for placing in a sports competition, such as a gold medal at the Olympics or the Stanley Cup in ice hockey @en-gb
definition: Medaljer från OS, VM osv. Sammanställningar av medaljskörd per nation. @se
definition: Æresbevisning eller hæder, som tildeles en atlet eller et hold , der har placeret sig blandt de bedste i en konkurrence. @dk
definition: Honra concedida a um atleta ou a uma equipa pelo lugar alcançado numa competição desportiva, como os Jogos Olímpicos.
definition: Honra concedida a um atleta ou a uma equipe pelo lugar alcançado em uma competição esportiva, como os Jogos Olímpicos.
definition: 运动员因参加体育比赛而获得的荣誉，如奥运会奖牌 @zh-hans
definition: Ehre, die einem Sportler für eine Platzierung in einem sportlichen Wettbewerb, z. B. bei den Olympischen Spielen, zuteil wird @de
in scheme: mediatopic
created: 2021-02-18T12:00:00+00:00
modified: 2022-09-23T12:00:00+00:00
broad match: Q15229207
broader: http://cv.iptc.org/newscodes/mediatopic/20001301