Schießerei
type: Concept
definition: Eine Gewalttat, die von Einzelpersonen unter Verwendung von bewaffneten Waffen begangen wird
in scheme: mediatopic
created: 2021-02-18T12:00:00+00:00
modified: 2021-07-12T12:00:00+00:00
broader: http://cv.iptc.org/newscodes/mediatopic/20000082