torture
type: Concept
preferred label: tortur @no-nb
preferred label: Tortyr @se
preferred label: Tortura @es
preferred label: Torture @fr
preferred label: تعذيب @ar
preferred label: Folter @de
definition: Intentionally inflicting severe physical or psychological pain in order to punish the victim or get the victim to take an action or give information
definition: Handlingar som via fysisk och/eller psykisk smärta eller lidande ska förmå det utsatte att erkänna, svara på frågor, utföra handlingar eller liknande. @se
definition: Absichtliche Zufügung schwerer körperlicher oder seelischer Schmerzen, um das Opfer zu bestrafen oder es zu einer Handlung oder Auskunft zu bewegen @de
in scheme: mediatopic
created: 2021-05-05T12:00:00+00:00
modified: 2021-12-21T12:00:00+00:00
broader: http://cv.iptc.org/newscodes/mediatopic/20000082