nett- og fjernundervisning
type: Concept
definition: Undervisning der lærer og elver/studenter ikke er på samme fysiske sted.
in scheme: mediatopic
created: 2021-09-30T12:00:00+00:00
modified: 2021-12-21T12:00:00+00:00
broader: http://cv.iptc.org/newscodes/mediatopic/05000000