Eid al-Adha
type: Concept
definition: Muslimisches Fest, das den Höhepunkt der jährlichen Hadsch-Pilgerfahrt markiert und an die Bereitschaft des Propheten Ibrahim erinnert, seinen Sohn zu opfern
in scheme: mediatopic
created: 2021-12-17T12:00:00+00:00
modified: 2021-12-21T12:00:00+00:00
broader: http://cv.iptc.org/newscodes/mediatopic/20000690