Hasidism
type: Concept
preferred label: hasidisme @no-nb
preferred label: Chassidism @se
preferred label: Jasidismo @es
preferred label: Hassidisme @fr
preferred label: حسيدية @ar
preferred label: Chassidismus @de
definition: Jewish religious group that believes that the Torah is the literal word of God and that carrying out this word is what gives meaning and purpose to life
definition: Strikt judisk trosinriktning som uppstod i Ukraina under 1700-talet. @se
definition: Jüdische religiöse Gruppe, die glaubt, dass die Thora das wörtliche Wort Gottes ist und dass die Umsetzung dieses Wortes dem Leben Sinn und Zweck verleiht @de
in scheme: mediatopic
created: 2021-12-17T12:00:00+00:00
modified: 2021-12-21T12:00:00+00:00
broader: http://cv.iptc.org/newscodes/mediatopic/20000679