depression
type: Concept
preferred label: Depresión @es
preferred label: Dépression @fr
preferred label: اكتئاب @ar
preferred label: depresjon @no-nn
preferred label: Depression @de
definition: A mental health disorder characterised by persistently depressed mood and loss of interest in activities, causing significant impairment in daily life
definition: A mental health disorder characterized by persistently depressed mood and loss of interest in activities, causing significant impairment in daily life
definition: Ett mer konstant tillstånd av nedstämdhet som innebär att den drabbade personen tappar intresset att göra saker och delta i vardagslivet. @se
definition: Eine psychische Krankheit, die durch eine anhaltend gedrückte Stimmung und den Verlust des Interesses an Aktivitäten gekennzeichnet ist und zu erheblichen Beeinträchtigungen im täglichen Leben führt @de
in scheme: mediatopic
created: 2022-06-14T12:00:00+00:00
modified: 2022-06-14T12:00:00+00:00
broader: http://cv.iptc.org/newscodes/mediatopic/20000458