Taxi und Fahrdienst
type: Concept
definition: Fahrdienste auf Abruf, die von Taxi- oder Technologieunternehmen wie Uber und Lyft angeboten werden, die Fahrer, die Fahrgäste befördern, und die Regeln und Vorschriften, die diesen Unternehmen in einer Region auferlegt werden
in scheme: mediatopic
created: 2022-09-23T12:00:00+00:00
modified: 2022-09-23T12:00:00+00:00
broader: http://cv.iptc.org/newscodes/mediatopic/20000337