taxi and ride-hailing
type: Concept
preferred label: taxi @no-nn
preferred label: Taxitjänster @se
preferred label: Taxi und Fahrdienst @de
definition: On-demand ride service, provided by taxi companies or tech companies such as Uber and Lyft, the drivers who transport passengers and the rules and regulations imposed upon these companies within a region
definition: Traditionella taxiföretag eller it-lösningar där personer kan betala för transporttjänster. @se
definition: Fahrdienste auf Abruf, die von Taxi- oder Technologieunternehmen wie Uber und Lyft angeboten werden, die Fahrer, die Fahrgäste befördern, und die Regeln und Vorschriften, die diesen Unternehmen in einer Region auferlegt werden @de
in scheme: mediatopic
created: 2022-09-23T12:00:00+00:00
modified: 2022-09-23T12:00:00+00:00
broader: http://cv.iptc.org/newscodes/mediatopic/20000337