business reporting and performance
type: Concept
preferred label: selskapsrapportering @no-nb
preferred label: Delårsrapport @se
preferred label: Geschäftsbericht und Leistung @de
definition: Measuring and reporting on the performance of a business
definition: Regelbunden redovisning av hur ett företag utvecklas. @se
definition: Messung und Berichterstattung über die Leistung eines Unternehmens @de
in scheme: mediatopic
created: 2023-03-31T12:00:00+00:00
modified: 2023-03-31T12:00:00+00:00
broader: http://cv.iptc.org/newscodes/mediatopic/20000170
narrower: http://cv.iptc.org/newscodes/mediatopic/20000172
narrower: http://cv.iptc.org/newscodes/mediatopic/20000176
narrower: http://cv.iptc.org/newscodes/mediatopic/20000178
narrower: http://cv.iptc.org/newscodes/mediatopic/20000179
narrower: http://cv.iptc.org/newscodes/mediatopic/20000180