business restructuring
type: Concept
preferred label: restrukturering @no-nb
preferred label: Företagsombildning @se
preferred label: Unternehmensumstrukturierung @de
definition: Changes to the structure of a business or organisation
definition: Ändring av ett företags eller organisations struktur. @se
definition: Änderungen in der Struktur eines Unternehmens oder einer Organisation @de
in scheme: mediatopic
created: 2023-03-31T12:00:00+00:00
modified: 2023-03-31T12:00:00+00:00
broader: http://cv.iptc.org/newscodes/mediatopic/20000170
narrower: http://cv.iptc.org/newscodes/mediatopic/20000197
narrower: http://cv.iptc.org/newscodes/mediatopic/20000200
narrower: http://cv.iptc.org/newscodes/mediatopic/20000201
narrower: http://cv.iptc.org/newscodes/mediatopic/20000203
narrower: http://cv.iptc.org/newscodes/mediatopic/20000204