podcast
type: Concept
preferred label: podkast @no-nb
preferred label: Podcast @se
definition: Podcast networks and the people who create and distribute audio content, typically in a series format, to audiences
definition: Nätverk och personer som framställer avsnitt om olika ämnen som lyssnare kan ta del av. @se
definition: Podcast-Netzwerke und die Personen, die Audio-Inhalte erstellen und verbreiten, in der Regel im Serienformat, an ein Publikum @de
in scheme: mediatopic
created: 2023-03-31T12:00:00+00:00
modified: 2023-03-31T12:00:00+00:00
broader: http://cv.iptc.org/newscodes/mediatopic/20000304