Nachhaltigkeit
type: Concept
definition: Maßnahmen von Unternehmen, Regierungen und Einzelpersonen zur Bekämpfung der wichtigsten Umweltprobleme, einschließlich Klimawandel, Verlust der biologischen Vielfalt, Verlust von Ökosystemleistungen, Bodendegradation sowie Luft- und Wasserverschmutzung
in scheme: mediatopic
created: 2023-10-02T12:00:00+00:00
modified: 2025-10-09T12:00:00+00:00
broader: http://cv.iptc.org/newscodes/mediatopic/06000000