sustainability
type: Concept
preferred label: berekraft @no-nn
preferred label: bærekraft @no-nb
preferred label: Hållbarhet @se
preferred label: Nachhaltigkeit @de
definition: Actions by organizations, governments, and individuals in response to environmental problems
definition: Åtgärder av företag, myndigheter och personer för att motverka miljöförstöring, klimatförändring och liknande. @se
definition: Maßnahmen von Unternehmen, Regierungen und Einzelpersonen zur Bekämpfung der wichtigsten Umweltprobleme, einschließlich Klimawandel, Verlust der biologischen Vielfalt, Verlust von Ökosystemleistungen, Bodendegradation sowie Luft- und Wasserverschmutzung @de
in scheme: mediatopic
created: 2023-10-02T12:00:00+00:00
modified: 2025-10-09T12:00:00+00:00
broader: http://cv.iptc.org/newscodes/mediatopic/06000000