war victims
type: Concept
preferred label: Krigsoffer @se
preferred label: krigsoffer @no-nb
preferred label: Kriegsopfer @de
definition: Individuals who are injured or killed in a war or armed conflict, including civilians
definition: Personer, både civila och militära, som skadats eller dödats i samband med krig eller militära konflikter. @se
definition: Personen, die in einem Krieg oder bewaffneten Konflikt verletzt oder getötet werden, einschließlich Zivilisten @de
in scheme: mediatopic
created: 2024-03-28T12:00:00+00:00
modified: 2024-03-28T12:00:00+00:00
broader: http://cv.iptc.org/newscodes/mediatopic/16000000
narrower: http://cv.iptc.org/newscodes/mediatopic/20000061
narrower: http://cv.iptc.org/newscodes/mediatopic/20000080
narrower: http://cv.iptc.org/newscodes/mediatopic/20001378