Nachwahl
type: Concept
definition: Eine Wahl, die dazu dient, ein Amt zu besetzen, das zwischen den allgemeinen Wahlen durch den Tod eines Politikers, einen Rücktritt oder aus anderen Gründen frei geworden ist
in scheme: mediatopic
created: 2024-09-26T12:00:00+00:00
modified: 2024-09-26T12:00:00+00:00
broader: http://cv.iptc.org/newscodes/mediatopic/20000574